Information card for entry 1000161
Chemical name | Rubidium pentafluorochromate(III) |
Formula | Cr F5 Rb2 |
Calculated formula | Cr F5 Rb2 |
Title of publication | La structure cristalline de Rb~2~ Cr F~5~ |
Authors of publication | Jacoboni, C; de Pape, R; Poulain, M; le Marouille, J Y; Grandjean, D |
Journal of publication | Acta Crystallographica B (24,1968-38,1982) |
Year of publication | 1974 |
Journal volume | 30 |
Pages of publication | 2688 - 2691 |
a | 7.515 ± 0.005 Å |
b | 5.724 ± 0.005 Å |
c | 11.985 ± 0.006 Å |
α | 90° |
β | 90° |
γ | 90° |
Cell volume | 515.5 Å3 |
Number of distinct elements | 3 |
Space group number | 62 |
Hermann-Mauguin space group symbol | P n m a |
Hall space group symbol | -P 2ac 2n |
Residual factor for all reflections | 0.064 |