Information card for entry 1000163
Chemical name | Thallium diniobium pentaoxide fluoride |
Formula | F Nb2 O5 Tl |
Calculated formula | F1.02 Nb2 O4.98 Tl |
Title of publication | Localisation des ions mobiles Tl(I) dans le conducteur ionique Tl Nb~2~ O~5~ F de type pyrochlore |
Authors of publication | Fourquet, J L; Jacoboni, C; de Pape, R |
Journal of publication | Acta Crystallographica B (24,1968-38,1982) |
Year of publication | 1979 |
Journal volume | 35 |
Pages of publication | 1570 - 1573 |
a | 10.506 ± 0.003 Å |
b | 10.506 ± 0.003 Å |
c | 10.506 ± 0.003 Å |
α | 90° |
β | 90° |
γ | 90° |
Cell volume | 1159.6 Å3 |
Number of distinct elements | 4 |
Space group number | 227 |
Hermann-Mauguin space group symbol | F d -3 m :2 |
Hall space group symbol | -F 4vw 2vw 3 |
Residual factor for all reflections | 0.069 |