Information card for entry 1001609
External links | AMCSD |
Chemical name | Yttrium barium cobalt copper oxide (1/1/1.1/0.9/5) |
Formula | Ba Co1.1 Cu0.9 O5 Y |
Calculated formula | Ba Co1.1 Cu0.9 O5 Y |
Title of publication | Spin state and variation of the spin orientation of Co(III) in the 112- type phase YBa(Co~2-x~Cu~x~)O~5~ |
Authors of publication | Barbey, L; Nguyen, N; Caignaert, V; Studer, F; Raveau, B |
Journal of publication | Journal of Solid State Chemistry |
Year of publication | 1994 |
Journal volume | 112 |
Pages of publication | 148 - 156 |
a | 3.8666 Å |
b | 3.8666 Å |
c | 7.5266 Å |
α | 90° |
β | 90° |
γ | 90° |
Cell volume | 112.5 Å3 |
Number of distinct elements | 5 |
Space group number | 123 |
Hermann-Mauguin space group symbol | P 4/m m m |
Hall space group symbol | -P 4 2 |
Residual factor for all reflections | 0.037 |