Information card for entry 1008827
External links | AMCSD |
Chemical name | Calcium neodymium phosphate(V) silicate fluoride oxide (9/1/5/1/1.5/0.25) |
Mineral name | Britholite (N |
Formula | Ca9 F1.5 Nd O24.25 P5 Si |
Calculated formula | Ca9 F1.54 Nd O24.28 P4.9998 Si1.0002 |
Title of publication | A neodymium-substituted britholite compound |
Authors of publication | Boyer, L; Savariault, J-M; Carpena, J; Lacout, J-L |
Journal of publication | Acta Crystallographica C (39,1983-) |
Year of publication | 1998 |
Journal volume | 54 |
Pages of publication | 1057 - 1057 |
a | 9.3938 ± 0.0008 Å |
b | 9.3938 ± 0.0008 Å |
c | 6.9013 ± 0.0005 Å |
α | 90° |
β | 90° |
γ | 120° |
Cell volume | 527.4 Å3 |
Number of distinct elements | 6 |
Space group number | 176 |
Hermann-Mauguin space group symbol | P 63/m |
Hall space group symbol | -P 6c |
Residual factor for all reflections | 0.035 |