Information card for entry 1010516
External links | AMCSD; ChemSpider |
Chemical name | Dinitrogen tetraoxide |
Formula | N2 O4 |
Calculated formula | N2 O4 |
SMILES | O=[N]=O |
Title of publication | Die Struktur von festem N~2~ O~4~ bei der Temperatur von fluessiger Luft. |
Authors of publication | Vegard, L |
Journal of publication | Zeitschrift fuer Physik |
Year of publication | 1931 |
Journal volume | 68 |
Pages of publication | 184 - 203 |
a | 7.77 Å |
b | 7.77 Å |
c | 7.77 Å |
α | 90° |
β | 90° |
γ | 90° |
Cell volume | 469.1 Å3 |
Number of distinct elements | 2 |
Space group number | 199 |
Hermann-Mauguin space group symbol | I 21 3 |
Hall space group symbol | I 2b 2c 3 |