Information card for entry 2000083
Formula | C6 H46 N6 O32 P6 Te2 |
Calculated formula | C8 H68 N8 O62 P12 Te2 |
Title of publication | Crystal chemistry of cyclo-hexaphosphates. VII. Structure of tris(ethylenediammonium) cyclo-hexaphosphate tellurate dihydrate |
Authors of publication | Averbuch-Pouchot, M. T.; Durif, A. |
Journal of publication | Acta Crystallographica, Section C: Crystal Structure Communications |
Year of publication | 1990 |
Journal volume | 46 |
Journal issue | 11 |
Pages of publication | 2236 - 2238 |
a | 10.945 ± 0.003 Å |
b | 11.252 ± 0.003 Å |
c | 8.042 ± 0.007 Å |
α | 90.9 ± 0.05° |
β | 92.97 ± 0.05° |
γ | 116.82 ± 0.05° |
Cell volume | 881.822 Å3 |
Number of distinct elements | 6 |
Space group number | 2 |
Hermann-Mauguin space group symbol | P -1 |
Hall space group symbol | -P 1 |
Residual factor for significantly intense reflections | 0.022 |
Weighted residual factors for significantly intense reflections | 0.022 |