Information card for entry 2005682
Original IUCr paper | HTML |
External links | ChemSpider |
Chemical name | (4-nitrobenzyl) oximinoether] hexahydroazepine 2,3-dione. |
Formula | C13 H15 N3 O4 |
Calculated formula | C13 H15 N3 O4 |
SMILES | O=N(=O)c1ccc(cc1)CO/N=C\1C(=O)NCCCC1 |
Title of publication | 3-(4-Nitrobenzyloximino)hexahydroazepin-2-one |
Authors of publication | Tranqui, D.; Elfrom, H.; Pera, H.; Leclerc, G. |
Journal of publication | Acta Crystallographica Section C |
Year of publication | 1996 |
Journal volume | 52 |
Journal issue | 11 |
Pages of publication | 2880 - 2882 |
a | 21.141 ± 0.005 Å |
b | 9.61 ± 0.003 Å |
c | 13.98 ± 0.004 Å |
α | 90° |
β | 107.33 ± 0.08° |
γ | 90° |
Cell volume | 2711.3 ± 1.8 Å3 |
Cell temperature | 293 ± 2 K |
Ambient diffraction temperature | 293 ± 2 K |
Number of distinct elements | 4 |
Space group number | 15 |
Hermann-Mauguin space group symbol | C 1 2/c 1 |
Hall space group symbol | -C 2yc |
Residual factor for all reflections | 0.0517 |
Residual factor for significantly intense reflections | 0.0406 |
Weighted residual factors for all reflections | 0.1077 |
Weighted residual factors for significantly intense reflections | 0.1008 |
Goodness-of-fit parameter for all reflections | 0.438 |
Goodness-of-fit parameter for significantly intense reflections | 0.55 |
Diffraction radiation wavelength | 1.5418 Å |
Diffraction radiation type | CuKα |