Information card for entry 9007501
External links | AMCSD |
Mineral name | Bonattite |
Formula | Cu H6 O7 S |
Calculated formula | Cu H6 O7 S |
SMILES | [Cu]([OH2])([OH2])[OH2].S(=O)(=O)([O-])[O-] |
Title of publication | On the crystal chemistry of salt hydrates. V. The determination of the crystal structure of CuSO4*3H2O (bonattite) Locality: synthetic |
Authors of publication | Zahrobsky, R. F.; Baur, W. H. |
Journal of publication | Acta Crystallographica, Section B |
Year of publication | 1968 |
Journal volume | 24 |
Pages of publication | 508 - 513 |
a | 5.592 Å |
b | 13.029 Å |
c | 7.341 Å |
α | 90° |
β | 97.05° |
γ | 90° |
Cell volume | 530.808 Å3 |
Number of distinct elements | 4 |
Space group number | 9 |
Hermann-Mauguin space group symbol | C 1 c 1 |
Hall space group symbol | C -2yc |