Information card for entry 9010666
External links | AMCSD |
Mineral name | Cupromakovickyite |
Formula | Ag0.52 Bi4.48 Cu2 Pb S9 |
Calculated formula | Ag0.52 Bi4.48 Cu2 Pb S9 |
Title of publication | What is the reason for the doubled unit-cell volumes of copper-lead-rich pavonite homologues? The crystal structures of cupromakovickyite and makovickyite |
Authors of publication | Topa, D.; Makovicky, E.; Balic-Zunic T |
Journal of publication | The Canadian Mineralogist |
Year of publication | 2008 |
Journal volume | 46 |
Pages of publication | 515 - 523 |
a | 13.405 Å |
b | 4.016 Å |
c | 29.949 Å |
α | 90° |
β | 99.989° |
γ | 90° |
Cell volume | 1587.85 Å3 |
Number of distinct elements | 5 |
Space group number | 12 |
Hermann-Mauguin space group symbol | C 1 2/m 1 |
Hall space group symbol | -C 2y |