Information card for entry 9014224
External links | AMCSD |
Mineral name | Stillwellite-(Ce) |
Formula | B Ce O5 Si |
Calculated formula | B Ce O5 Si |
Title of publication | X-ray diffraction study of the atomic structure of stillwellite CeBO[SiO4] |
Authors of publication | Voronkov, A. A.; Pyatenko, Y. A. |
Journal of publication | Soviet Physics Crystallography |
Year of publication | 1967 |
Journal volume | 12 |
Pages of publication | 214 - 220 |
a | 6.85 Å |
b | 6.85 Å |
c | 6.7 Å |
α | 90° |
β | 90° |
γ | 120° |
Cell volume | 272.262 Å3 |
Number of distinct elements | 4 |
Space group number | 144 |
Hermann-Mauguin space group symbol | P 31 |
Hall space group symbol | P 31 |