Information card for entry 9014234
External links | AMCSD |
Mineral name | Cohenite |
Formula | C Fe3 |
Calculated formula | C Fe3 |
SMILES | [Fe].[Fe].[Fe].[C] |
Title of publication | Thermal expansion and crystal structure of cementite, Fe3C, between 4 and 600 K determined by time-of-flight neutron powder diffraction Note: T = 200 K |
Authors of publication | Wood, I. G.; Vocadlo, L.; Knight, K. S.; Dobson, D. P.; Marshall, W. G.; Price, G. D.; Brodholt, J. |
Journal of publication | Journal of Applied Crystallography |
Year of publication | 2004 |
Journal volume | 37 |
Pages of publication | 82 - 90 |
a | 5.082 Å |
b | 6.746 Å |
c | 4.512 Å |
α | 90° |
β | 90° |
γ | 90° |
Cell volume | 154.686 Å3 |
Cell temperature | 200 K |
Ambient diffraction temperature | 200 K |
Number of distinct elements | 2 |
Space group number | 62 |
Hermann-Mauguin space group symbol | P n m a |
Hall space group symbol | -P 2ac 2n |
Duplicate of | 2300071 |