Information card for entry 1010922
External links | AMCSD |
Chemical name | Antimony phyllo-tetraoxoantimonate |
Mineral name | Cervantite |
Formula | O4 Sb2 |
Calculated formula | O4 Sb2 |
SMILES | [Sb+3].[Sb+5].[O-2].[O-2].[O-2].[O-2] |
Title of publication | Ueber den Bau des wahren Antimontetroxyds und des damit isomorphen Stibiotantalits, Sb Ta O4 |
Authors of publication | Dihlstroem, K |
Journal of publication | Zeitschrift fuer Anorganische und Allgemeine Chemie |
Year of publication | 1938 |
Journal volume | 239 |
Pages of publication | 57 - 64 |
a | 4.804 Å |
b | 5.424 Å |
c | 11.76 Å |
α | 90° |
β | 90° |
γ | 90° |
Cell volume | 306.4 Å3 |
Number of distinct elements | 2 |
Space group number | 33 |
Hermann-Mauguin space group symbol | P b n 21 |
Hall space group symbol | P 2c -2ab |