Information card for entry 1010923
External links | AMCSD |
Chemical name | Pentasodium trialuminium fluoride |
Mineral name | Chiolite |
Formula | Al3 F14 Na5 |
Calculated formula | Al3 F14 Na5 |
Title of publication | Die Kristallstruktur des Chioliths |
Authors of publication | Brosset, C |
Journal of publication | Zeitschrift fuer Anorganische und Allgemeine Chemie |
Year of publication | 1938 |
Journal volume | 238 |
Pages of publication | 201 - 208 |
a | 7 ± 0.01 Å |
b | 7 ± 0.01 Å |
c | 10.39 ± 0.01 Å |
α | 90° |
β | 90° |
γ | 90° |
Cell volume | 509.1 Å3 |
Number of distinct elements | 3 |
Space group number | 128 |
Hermann-Mauguin space group symbol | P 4/m n c |
Hall space group symbol | -P 4 2n |