Information card for entry 9009638
External links | AMCSD |
Mineral name | Powellite |
Formula | Ca Mo O4 |
Calculated formula | Ca Mo O4 |
Title of publication | High-pressure crystal chemistry of scheelite-type tungstates and molybdates Note: P = 5.71 GPa |
Authors of publication | Hazen, R. M.; Finger, L. W.; Mariathasan, J. W. E. |
Journal of publication | Journal of Physics and Chemistry of Solids |
Year of publication | 1985 |
Journal volume | 46 |
Pages of publication | 253 - 263 |
a | 5.1286 Å |
b | 5.1286 Å |
c | 11.119 Å |
α | 90° |
β | 90° |
γ | 90° |
Cell volume | 292.458 Å3 |
Ambient diffracton pressure | 5710000 kPa |
Number of distinct elements | 3 |
Space group number | 88 |
Hermann-Mauguin space group symbol | I 41/a :2 |
Hall space group symbol | -I 4ad |