Information card for entry 9009639
External links | AMCSD |
Formula | C K Li O3 |
Calculated formula | C K Li O3 |
Title of publication | Crystal structure of (LixK1-x)2CO3 (x = 0,0.43,0.5,0.62,1) by neutron powder diffraction analysis Sample: contains only 7Li |
Authors of publication | Idemoto, Y.; Richardson, J. W.; Koura, N.; Kohara, S.; Loong, C. K. |
Journal of publication | Journal of Physics and Chemistry of Solids |
Year of publication | 1998 |
Journal volume | 59 |
Pages of publication | 363 - 376 |
a | 7.22284 Å |
b | 7.07673 Å |
c | 7.59397 Å |
α | 90° |
β | 127.421° |
γ | 90° |
Cell volume | 308.273 Å3 |
Number of distinct elements | 4 |
Space group number | 14 |
Hermann-Mauguin space group symbol | P 1 21/c 1 |
Hall space group symbol | -P 2ybc |