Information card for entry 9009788
External links | AMCSD |
Mineral name | Stibiotantalite |
Formula | O4 Sb Ta |
Calculated formula | O4 Sb Ta |
Title of publication | Uber den bau des wahren antimontetroxyds und des damit isomorphen stibiotantalits, SbTaO4 |
Authors of publication | Dihlstrom, K. |
Journal of publication | Zeitschrift fur Anorganische und Allgemeine Chemie |
Year of publication | 1938 |
Journal volume | 239 |
Pages of publication | 57 - 64 |
a | 4.916 Å |
b | 5.542 Å |
c | 11.78 Å |
α | 90° |
β | 90° |
γ | 90° |
Cell volume | 320.94 Å3 |
Number of distinct elements | 3 |
Space group number | 33 |
Hermann-Mauguin space group symbol | P b n 21 |
Hall space group symbol | P 2c -2ab |