Information card for entry 9009787
External links | AMCSD |
Mineral name | Mopungite |
Formula | H6 Na O6 Sb |
Calculated formula | H6 Na O6 Sb |
SMILES | [Na+].O[Sb](O)(O)(O)(O)O |
Title of publication | Rontgenuntersuchung der verbindungen NaSb(OH)6, NaSbF6, NaSbO3 und gleichartiger stoffe |
Authors of publication | Schrewelius, N. |
Journal of publication | Zeitschrift fur Anorganische und Allgemeine Chemie |
Year of publication | 1938 |
Journal volume | 238 |
Pages of publication | 241 - 254 |
a | 8.01 Å |
b | 8.01 Å |
c | 7.88 Å |
α | 90° |
β | 90° |
γ | 90° |
Cell volume | 505.582 Å3 |
Number of distinct elements | 4 |
Space group number | 86 |
Hermann-Mauguin space group symbol | P 42/n :1 |
Hall space group symbol | P 4n -1n |