Information card for entry 9009786
Mineral name | Chiolite |
Formula | Al3 F14 Na5 |
Calculated formula | Al3 F14 Na5 |
Title of publication | Die kristallstruktur des chioliths |
Authors of publication | Brosset, C. |
Journal of publication | Zeitschrift fur Anorganische und Allgemeine Chemie |
Year of publication | 1938 |
Journal volume | 238 |
Pages of publication | 201 - 208 |
a | 7 Å |
b | 7 Å |
c | 10.39 Å |
α | 90° |
β | 90° |
γ | 90° |
Cell volume | 509.11 Å3 |
Number of distinct elements | 3 |
Space group number | 128 |
Hermann-Mauguin space group symbol | P 4/m n c |
Hall space group symbol | -P 4 2n |
Duplicate of | 1010923 |