Information card for entry 9010670
External links | AMCSD |
Mineral name | Szaibelyite |
Formula | B H Mg O3 |
Calculated formula | B H Mg O3 |
Title of publication | Szaibelyite: Crystal structure analysis and hydrogen bonding |
Authors of publication | Grice, J. D. |
Journal of publication | The Canadian Mineralogist |
Year of publication | 2008 |
Journal volume | 46 |
Pages of publication | 671 - 677 |
a | 12.586 Å |
b | 10.415 Å |
c | 3.134 Å |
α | 90° |
β | 95.923° |
γ | 90° |
Cell volume | 408.622 Å3 |
Number of distinct elements | 4 |
Space group number | 14 |
Hermann-Mauguin space group symbol | P 1 21/a 1 |
Hall space group symbol | -P 2yab |