Information card for entry 9010671
External links | AMCSD |
Mineral name | Magnesiopascoite |
Formula | Ca2 H32 Mg O44 V10 |
Calculated formula | Ca2 H32 Mg O44 V10 |
Title of publication | Magnesiopascoite, a new member of the pascoite group: description and crystal structure Locality: Blue Cap mine, San Juan County, Utah, USA |
Authors of publication | Kampf, A. R.; Steele, I. M. |
Journal of publication | The Canadian Mineralogist |
Year of publication | 2008 |
Journal volume | 46 |
Pages of publication | 679 - 686 |
a | 19.8442 Å |
b | 9.9353 Å |
c | 10.7149 Å |
α | 90° |
β | 120.305° |
γ | 90° |
Cell volume | 1823.85 Å3 |
Number of distinct elements | 5 |
Space group number | 12 |
Hermann-Mauguin space group symbol | C 1 2/m 1 |
Hall space group symbol | -C 2y |