Information card for entry 9012315
External links | AMCSD |
Mineral name | Gananite |
Formula | Bi F3 |
Calculated formula | Bi F3 |
SMILES | [Bi+3].[F-].[F-].[F-] |
Title of publication | Der kristallbau von a-BiF3 |
Authors of publication | Hund, F.; Fricke, R. |
Journal of publication | Zeitschrift fur Anorganische und Allgemeine Chemie |
Year of publication | 1949 |
Journal volume | 258 |
Pages of publication | 198 - 204 |
a | 5.853 Å |
b | 5.853 Å |
c | 5.853 Å |
α | 90° |
β | 90° |
γ | 90° |
Cell volume | 200.51 Å3 |
Number of distinct elements | 2 |
Space group number | 215 |
Hermann-Mauguin space group symbol | P -4 3 m |
Hall space group symbol | P -4 2 3 |