Information card for entry 9012314
Mineral name | Cervantite |
Formula | O2 Sb |
Calculated formula | O2 Sb |
SMILES | [Sb+5].[Sb+3].[O-2].[O-2].[O-2].[O-2] |
Title of publication | Uber den bau des wahren antimontetroxyds und des damit isomorphen stibiotantalits, SbTaO4 |
Authors of publication | Dihlstrom, K. |
Journal of publication | Zeitschrift fur Anorganische und Allgemeine Chemie |
Year of publication | 1938 |
Journal volume | 239 |
Pages of publication | 57 - 64 |
a | 4.804 Å |
b | 5.424 Å |
c | 11.76 Å |
α | 90° |
β | 90° |
γ | 90° |
Cell volume | 306.429 Å3 |
Number of distinct elements | 2 |
Space group number | 33 |
Hermann-Mauguin space group symbol | P b n 21 |
Hall space group symbol | P 2c -2ab |
Duplicate of | 1010922 |