Information card for entry 9012416
External links | AMCSD |
Mineral name | Gismondine |
Formula | Al2 Ca H8.606 O12.303 Si2 |
Calculated formula | Al2 Ca H8.606 O12.303 Si2 |
Title of publication | Neutron diffraction structure refinement of the zeolite gismondine at 15 K Sample: T = 15 K |
Authors of publication | Artioli, G.; Rinaldi, R.; Kvick, A.; Smith, J. V. |
Journal of publication | Zeolites |
Year of publication | 1986 |
Journal volume | 6 |
Pages of publication | 361 - 366 |
a | 10.011 Å |
b | 10.614 Å |
c | 9.853 Å |
α | 90° |
β | 93.11° |
γ | 90° |
Cell volume | 1045.41 Å3 |
Ambient diffraction temperature | 15 K |
Number of distinct elements | 5 |
Space group number | 14 |
Hermann-Mauguin space group symbol | P 1 21/c 1 |
Hall space group symbol | -P 2ybc |