Information card for entry 9012417
Mineral name | Gismondine |
Formula | Al2 Ca H8 O12 Si2 |
Calculated formula | Al2 Ca H8 O12 Si2 |
Title of publication | Structural modifications induced by dehydration in the zeolite gismondine Locality: Montalto di Castro, Italy Sample: dehydration t = 1 hr |
Authors of publication | Vezzalini, G.; Quartieri, S.; Alberti, A. |
Journal of publication | Zeolites |
Year of publication | 1993 |
Journal volume | 13 |
Pages of publication | 34 - 42 |
a | 9.989 Å |
b | 10.616 Å |
c | 9.82 Å |
α | 90° |
β | 92.57° |
γ | 90° |
Cell volume | 1040.3 Å3 |
Number of distinct elements | 5 |
Hermann-Mauguin space group symbol | P 1 21 1 |