Information card for entry 9014236
External links | AMCSD |
Formula | Ho2 O3 |
Calculated formula | Ho2 O3 |
Title of publication | Untersuchungen ueber die Kristallstruktur von Sesquioxyden und Verbindungen ABO3 _cod_database_code 1010591 |
Authors of publication | Zachariasen, W. |
Journal of publication | Skrifter utgitt av det Norske Videnskaps-Akademi i Oslo |
Year of publication | 1928 |
Journal volume | 1 |
Pages of publication | 1 - 165 |
a | 10.58 Å |
b | 10.58 Å |
c | 10.58 Å |
α | 90° |
β | 90° |
γ | 90° |
Cell volume | 1184.29 Å3 |
Number of distinct elements | 2 |
Space group number | 199 |
Hermann-Mauguin space group symbol | I 21 3 |
Hall space group symbol | I 2b 2c 3 |
Duplicate of | 1010591 |