Information card for entry 9014237
External links | AMCSD |
Mineral name | Siderite |
Formula | C Fe O3 |
Calculated formula | C Fe O3 |
Title of publication | Structure of siderite FeCO3 to 56 GPa and hysteresis of its spin-pairing transition Note: run P8, P = 19.19 GPa |
Authors of publication | Lavina, B.; Dera, P.; Downs, R. T.; Yang, W.; Sinogeikin, S.; Meng, Y.; Shen, G.; Schiferl, D. |
Journal of publication | Physical Review B |
Year of publication | 2010 |
Journal volume | 82 |
Pages of publication | 064110 - 064118 |
a | 4.579 Å |
b | 4.579 Å |
c | 14.28 Å |
α | 90° |
β | 90° |
γ | 120° |
Cell volume | 259.299 Å3 |
Number of distinct elements | 3 |
Space group number | 167 |
Hermann-Mauguin space group symbol | R -3 c :H |
Hall space group symbol | -R 3 2"c |