Information card for entry 9014238
External links | AMCSD |
Formula | Li0.5 Mo0.5 N |
Calculated formula | Li0.5 Mo0.5 N |
Title of publication | LiMoN2: the first metallic layered nitride _cod_database_code 1005011 |
Authors of publication | Elder, S.; Doerrer, L.; DiSalvo, F.; Parise, J.; Guyomard, D.; Tarascon, J. |
Journal of publication | Chemistry of Materials |
Year of publication | 1992 |
Journal volume | 4 |
Pages of publication | 928 - 937 |
a | 2.8674 Å |
b | 2.8674 Å |
c | 15.801 Å |
α | 90° |
β | 90° |
γ | 120° |
Cell volume | 112.51 Å3 |
Number of distinct elements | 3 |
Space group number | 146 |
Hermann-Mauguin space group symbol | R 3 :H |
Hall space group symbol | R 3 |
Duplicate of | 1005011 |