Information card for entry 9016381
External links | AMCSD |
Mineral name | Anthophyllite |
Formula | Mg7 O24 Si8 |
Calculated formula | Mg7 O24 Si8 |
Title of publication | The structure of Anthophyllite H2 Mg7 (Si O3)8 _cod_database_code 1010935 |
Authors of publication | Warren, B.; Modell, D. |
Journal of publication | Zeitschrift fur Kristallographie |
Year of publication | 1930 |
Journal volume | 75 |
Pages of publication | 161 - 179 |
a | 18.5 Å |
b | 17.89999 Å |
c | 5.27 Å |
α | 90° |
β | 90° |
γ | 90° |
Cell volume | 1745.16 Å3 |
Number of distinct elements | 3 |
Space group number | 62 |
Hermann-Mauguin space group symbol | P n m a |
Hall space group symbol | -P 2ac 2n |
Duplicate of | 1010935 |