Information card for entry 9016382
External links | AMCSD |
Formula | N O2 |
Calculated formula | N O2 |
Title of publication | Die Struktur von festem N2 O4 bei der Temperatur von fluessiger Luft. _cod_database_code 1010516 |
Authors of publication | Vegard, L. |
Journal of publication | Zeitschrift fur Physik |
Year of publication | 1931 |
Journal volume | 68 |
Pages of publication | 184 - 203 |
a | 7.77 Å |
b | 7.77 Å |
c | 7.77 Å |
α | 90° |
β | 90° |
γ | 90° |
Cell volume | 469.097 Å3 |
Number of distinct elements | 2 |
Space group number | 199 |
Hermann-Mauguin space group symbol | I 21 3 |
Hall space group symbol | I 2b 2c 3 |
Duplicate of | 1010516 |