Information card for entry 9016383
External links | AMCSD |
Mineral name | Bertossaite |
Formula | Al4 Ca0.87 H4 Li3.72 Na0.41 O20 P4 |
Calculated formula | Al4 Ca0.87 H4 Li3.72 Na0.41 O20 P4 |
Title of publication | The crystal structure of bertossaite, CaLi2[Al4(PO4)4(OH,F)4] |
Authors of publication | Hatert, F.; Lefevre, P.; Fransolet, A. M. |
Journal of publication | The Canadian Mineralogist |
Year of publication | 2011 |
Journal volume | 49 |
Pages of publication | 1079 - 1087 |
a | 11.476 Å |
b | 15.744 Å |
c | 7.228 Å |
α | 90° |
β | 90° |
γ | 90° |
Cell volume | 1305.94 Å3 |
Number of distinct elements | 7 |
Space group number | 72 |
Hermann-Mauguin space group symbol | I m c b |
Hall space group symbol | -I 2a 2 |