Information card for entry 9016386
External links | AMCSD |
Formula | F15 Fe5 K3 |
Calculated formula | F15 Fe5 K3 |
Title of publication | Structure cristalline du bronze pseudo-quadratique K0.6FeF~3: Transition pyrochlore-quadratique pour les composes KMM'6 |
Authors of publication | Hardy, A. M.; Hardy, A.; Ferey, G. |
Journal of publication | Acta Crystallographica, Section B |
Year of publication | 1973 |
Journal volume | 29 |
Journal issue | 8 |
Pages of publication | 1654 - 1658 |
a | 12.75 Å |
b | 12.637 Å |
c | 3.986 Å |
α | 90° |
β | 90° |
γ | 90° |
Cell volume | 642.231 Å3 |
Number of distinct elements | 3 |
Space group number | 32 |
Hermann-Mauguin space group symbol | P b a 2 |
Hall space group symbol | P 2 -2ab |
Duplicate of | 1000162 |