Information card for entry 9016387
External links | AMCSD |
Mineral name | Seelite |
Formula | As2 H8 Mg O16 U2 |
Calculated formula | As2 H8 Mg O16 U2 |
Title of publication | Structure of Mg[(UO2)(AsO4)]2*4H2O |
Authors of publication | Bachet, B.; Brassy, C. |
Journal of publication | Acta Crystallographica, Section C |
Year of publication | 1991 |
Journal volume | 47 |
Pages of publication | 2013 - 2015 |
a | 18.207 Å |
b | 7.062 Å |
c | 6.661 Å |
α | 90° |
β | 99.65° |
γ | 90° |
Cell volume | 844.338 Å3 |
Number of distinct elements | 5 |
Space group number | 12 |
Hermann-Mauguin space group symbol | C 1 2/m 1 |
Hall space group symbol | -C 2y |